Reaction Details
TargetCholinesterase
LigandBDBM10624
Substrate/Competitorn/a
Meas. Tech.ChEMBL_699907 (CHEMBL1646126)
IC50 354000±n/a nM
Citation Musilek, KRoder, JKomloova, MHolas, OHrabinova, MPohanka, MDohnal, VOpletalova, VKuca, KJung, YS Preparation, in vitro screening and molecular modelling of symmetrical 4-tert-butylpyridinium cholinesterase inhibitors--analogues of SAD-128. Bioorg Med Chem Lett21:150-4 (2010) 
 
Cholinesterase
Name:Cholinesterase
Type:Homotetramer
Mol. Mass.:68422.27
Organism:Homo sapiens (Human)
Description:P06276
Residue:602
BDBM10624
NameBDBM10624
Synonyms:1,5-bis(4-allyldimethylammoniumphenyl)-pentan-3-one dibromide BW284c51 CHEMBL464538
TypeSmall organic molecule
Emp. Form.C27H38N2O
Mol. Mass.406.6023
SMILESC[N+](C)(CC=C)c1ccc(CCC(=O)CCc2ccc(cc2)[N+](C)(C)CC=C)cc1