Reaction Details
TargetSteroid hormone receptor ERR1
LigandBDBM50336750
Substrate/Competitorn/a
Meas. Tech.ChEMBL_718276 (CHEMBL1679580)
IC50>10000±n/a nM
Citation Patch, RJSearle, LLKim, AJDe, DZhu, XAskari, HBO'Neill, JCAbad, MCRentzeperis, DLiu, JKemmerer, MLin, LKasturi, JGeisler, JGLenhard, JMPlayer, MRGaul, MD Identification of diaryl ether-based ligands for estrogen-related receptora as potential antidiabetic agents. J Med Chem54:788-808 (2012) 
 
Steroid hormone receptor ERR1
Name:Steroid hormone receptor ERR1
Type:PROTEIN
Mol. Mass.:45508.08
Organism:Homo sapiens (Human)
Description:ChEMBL_1499891
Residue:423
BDBM50336750
NameBDBM50336750
Synonyms:4-[4-(2,4-Dioxothiazolidin-5-ylidenemethyl)-2-methoxyphenoxy]-3-nitrobenzonitrile | CHEMBL1671958
TypeSmall organic molecule
Emp. Form.C18H11N3O6S
Mol. Mass.397.361
SMILESCOc1cc(C=C2SC(O)=NC2=O)ccc1Oc1ccc(cc1[N+]([O-])=O)C#N