Reaction Details
TargetCytochrome P450 3A4
LigandBDBM50336739
Substrate/Competitorn/a
Meas. Tech.ChEMBL_718343 (CHEMBL1679763)
IC50 800±n/a nM
Citation Patch, RJSearle, LLKim, AJDe, DZhu, XAskari, HBO'Neill, JCAbad, MCRentzeperis, DLiu, JKemmerer, MLin, LKasturi, JGeisler, JGLenhard, JMPlayer, MRGaul, MD Identification of diaryl ether-based ligands for estrogen-related receptora as potential antidiabetic agents. J Med Chem54:788-808 (2012) 
 
Cytochrome P450 3A4
Name:Cytochrome P450 3A4
Type:Enzyme
Mol. Mass.:57349.57
Organism:Homo sapiens (Human)
Description:n/a
Residue:503
BDBM50336739
NameBDBM50336739
Synonyms:4-[4-(2,4-Dioxothiazolidin-5-ylidenemethyl)-2-methoxyphenoxy]-naphthalene-1-carboxylic Acid Methyl Ester | CHEMBL1671982
TypeSmall organic molecule
Emp. Form.C23H17NO6S
Mol. Mass.435.449
SMILESCOC(=O)c1ccc(Oc2ccc(C=C3SC(O)=NC3=O)cc2OC)c2ccccc12