Reaction Details
TargetSteroid 17-alpha-hydroxylase/17,20 lyase
LigandBDBM50338351
Substrate/Competitorn/a
Meas. Tech.ChEMBL_728149 (CHEMBL1687150)
IC50 13±n/a nM
Citation Kaku, TMatsunaga, NOjida, ATanaka, THara, TYamaoka, MKusaka, MTasaka, A 17,20-lyase inhibitors. Part 4: design, synthesis and structure-activity relationships of naphthylmethylimidazole derivatives as novel 17,20-lyase inhibitors. Bioorg Med Chem19:1751-70 (2011) 
 
Steroid 17-alpha-hydroxylase/17,20 lyase
Name:Steroid 17-alpha-hydroxylase/17,20 lyase
Type:Enzyme
Mol. Mass.:57255.68
Organism:Rattus norvegicus (Rat)
Description:P11715
Residue:507
BDBM50338351
NameBDBM50338351
Synonyms:CHEMBL1682895 | rac-6-[1-Hydroxy-1-(1H-imidazol-4-yl)-2-methylpropyl]-Npropyl-2-naphthamide
TypeSmall organic molecule
Emp. Form.C21H25N3O2
Mol. Mass.351.4421
SMILESCCCNC(=O)c1ccc2cc(ccc2c1)C(O)(C(C)C)c1cnc[nH]1