Reaction Details
TargetSteroid 17-alpha-hydroxylase/17,20 lyase
LigandBDBM50338365
Substrate/Competitorn/a
Meas. Tech.ChEMBL_728150 (CHEMBL1687151)
IC50 19±n/a nM
Citation Kaku, TMatsunaga, NOjida, ATanaka, THara, TYamaoka, MKusaka, MTasaka, A 17,20-lyase inhibitors. Part 4: design, synthesis and structure-activity relationships of naphthylmethylimidazole derivatives as novel 17,20-lyase inhibitors. Bioorg Med Chem19:1751-70 (2011) 
 
Steroid 17-alpha-hydroxylase/17,20 lyase
Name:Steroid 17-alpha-hydroxylase/17,20 lyase
Type:Enzyme
Mol. Mass.:57382.42
Organism:Homo sapiens (Human)
Description:E.coli expressing human CYP17
Residue:508
BDBM50338365
NameBDBM50338365
Synonyms:(-)-(S)-7-(1-hydroxy-1-(1H-imidazol-4-yl)-2-methylpropyl)-2-methyl-1H-benzo[e]isoindol-3(2H)-one | CHEMBL1682904
TypeSmall organic molecule
Emp. Form.C20H21N3O2
Mol. Mass.335.3996
SMILESCC(C)[C@@](O)(c1cnc[nH]1)c1ccc2c3CN(C)C(=O)c3ccc2c1