Reaction Details
TargetSucrase-isomaltase, intestinal
LigandBDBM50327502
Substrate/Competitorn/a
Meas. Tech.ChEMBL_726860 (CHEMBL1686566)
IC50 1000±n/a nM
Citation Xie, WTanabe, GAkaki, JMorikawa, TNinomiya, KMinematsu, TYoshikawa, MWu, XMuraoka, O Isolation, structure identification and SAR studies on thiosugar sulfonium salts, neosalaprinol and neoponkoranol, as potenta-glucosidase inhibitors. Bioorg Med Chem19:2015-22 (2011) 
 
Sucrase-isomaltase, intestinal
Name:Sucrase-isomaltase, intestinal
Type:Enzyme
Mol. Mass.:210329.04
Organism:Rattus norvegicus (Rat)
Description:P23739
Residue:1841
BDBM50327502
NameBDBM50327502
Synonyms:(1R,2R,3S,4S)-3,4-dihydroxy-2-(hydroxymethyl)-1-((2S,3S,4R,5S)-2,3,4,5,6-pentahydroxyhexyl)tetrahydro-1H-thiophenium chloride | CHEMBL1258529
TypeSmall organic molecule
Emp. Form.C11H23O8S
Mol. Mass.315.36
SMILESOC[C@H](O)[C@@H](O)[C@H](O)[C@H](O)C[S@@+]1C[C@@H](O)[C@H](O)[C@H]1CO