Reaction Details
TargetTYR_PHOSPHATASE_2 domain-containing protein
LigandBDBM50343144
Substrate/Competitorn/a
Meas. Tech.ChEMBL_745275 (CHEMBL1775307)
IC50 15500±n/a nM
Citation Chen, LZhou, BZhang, SWu, LWang, YFranzblau, SGZhang, ZY Identification and characterization of novel inhibitors of mPTPB, an essential virulent phosphatase from Mycobacterium tuberculosis. ACS Med Chem Lett1:355-359 (2010) 
 
TYR_PHOSPHATASE_2 domain-containing protein
Name:TYR_PHOSPHATASE_2 domain-containing protein
Type:Hydrolase
Mol. Mass.:30152.45
Organism:Mycobacterium tuberculosis
Description:n/a
Residue:276
BDBM50343144
NameBDBM50343144
Synonyms:CHEMBL1773170 | N-(3-chloro-4-hydroxynaphthalen-1-yl)-2-oxo-1,2-dihydrobenzo[cd]indole-6-sulfonamide
TypeSmall organic molecule
Emp. Form.C21H13ClN2O4S
Mol. Mass.424.857
SMILESOc1c(Cl)cc(NS(=O)(=O)c2ccc3NC(=O)c4cccc2c34)c2ccccc12