Reaction Details
TargetCyclin-dependent kinase 1
LigandBDBM50205472
Substrate/Competitorn/a
Meas. Tech.ChEMBL_812218 (CHEMBL2013813)
IC50 19±n/a nM
Citation Le Brazidec, JYPasis, ATam, BBoykin, CBlack, CWang, DClaassen, GChong, JHChao, JFan, JNguyen, KSilvian, LLing, LZhang, LChoi, MTeng, MPathan, NZhao, SLi, TTaveras, A Synthesis, SAR and biological evaluation of 1,6-disubstituted-1H-pyrazolo[3,4-d]pyrimidines as dual inhibitors of Aurora kinases and CDK1. Bioorg Med Chem Lett22:2070-4 (2012) 
 
Cyclin-dependent kinase 1
Name:Cyclin-dependent kinase 1
Type:Enzyme Subunit
Mol. Mass.:34101.08
Organism:Homo sapiens (Human)
Description:P06493
Residue:297
BDBM50205472
NameBDBM50205472
Synonyms:(5Z)-5-(quinolin-6-ylmethylidene)-2-[(thiophen-2-ylmethyl)amino]-1,3-thiazol-4(5H)-one CHEMBL261644 | CHEMBL393929
TypeSmall organic molecule
Emp. Form.C18H13N3OS2
Mol. Mass.351.445
SMILESO=C1N=C(NCc2cccs2)SC1=Cc1ccc2ncccc2c1