Reaction Details
TargetAurora kinase B
LigandBDBM50379491
Substrate/Competitorn/a
Meas. Tech.ChEMBL_812217 (CHEMBL2013812)
IC50 5±n/a nM
Citation Le Brazidec, JYPasis, ATam, BBoykin, CBlack, CWang, DClaassen, GChong, JHChao, JFan, JNguyen, KSilvian, LLing, LZhang, LChoi, MTeng, MPathan, NZhao, SLi, TTaveras, A Synthesis, SAR and biological evaluation of 1,6-disubstituted-1H-pyrazolo[3,4-d]pyrimidines as dual inhibitors of Aurora kinases and CDK1. Bioorg Med Chem Lett22:2070-4 (2012) 
 
Aurora kinase B
Name:Aurora kinase B
Type:Protein
Mol. Mass.:39327.72
Organism:Homo sapiens (Human)
Description:Q96GD4
Residue:344
BDBM50379491
NameBDBM50379491
Synonyms:CHEMBL2012401
TypeSmall organic molecule
Emp. Form.C19H25N7O
Mol. Mass.367.4481
SMILESCn1cc(Nc2ncc3cnn(C4CCC(C)(C)CC4)c3n2)cc1C(N)=O