Reaction Details
TargetCyclin-dependent kinase 1
LigandBDBM50379493
Substrate/Competitorn/a
Meas. Tech.ChEMBL_812218 (CHEMBL2013813)
IC50 1700±n/a nM
Citation Le Brazidec, JYPasis, ATam, BBoykin, CBlack, CWang, DClaassen, GChong, JHChao, JFan, JNguyen, KSilvian, LLing, LZhang, LChoi, MTeng, MPathan, NZhao, SLi, TTaveras, A Synthesis, SAR and biological evaluation of 1,6-disubstituted-1H-pyrazolo[3,4-d]pyrimidines as dual inhibitors of Aurora kinases and CDK1. Bioorg Med Chem Lett22:2070-4 (2012) 
 
Cyclin-dependent kinase 1
Name:Cyclin-dependent kinase 1
Type:Enzyme Subunit
Mol. Mass.:34101.08
Organism:Homo sapiens (Human)
Description:P06493
Residue:297
BDBM50379493
NameBDBM50379493
Synonyms:CHEMBL2012404
TypeSmall organic molecule
Emp. Form.C24H30N8O2
Mol. Mass.462.5474
SMILESCN(C)C(=O)[C@@H]1CCCN1C(=O)c1cc(Nc2ncc3cnn([C@H]4C[C@@H]5C[C@@H]5C4)c3n2)cn1C