Reaction Details
TargetAurora kinase A
LigandBDBM50379503
Substrate/Competitorn/a
Meas. Tech.ChEMBL_812216 (CHEMBL2013811)
IC50 1.5±n/a nM
Citation Le Brazidec, JYPasis, ATam, BBoykin, CBlack, CWang, DClaassen, GChong, JHChao, JFan, JNguyen, KSilvian, LLing, LZhang, LChoi, MTeng, MPathan, NZhao, SLi, TTaveras, A Synthesis, SAR and biological evaluation of 1,6-disubstituted-1H-pyrazolo[3,4-d]pyrimidines as dual inhibitors of Aurora kinases and CDK1. Bioorg Med Chem Lett22:2070-4 (2012) 
 
Aurora kinase A
Name:Aurora kinase A
Type:Serine/threonine-protein kinase
Mol. Mass.:45830.98
Organism:Homo sapiens (Human)
Description:O14965
Residue:403
BDBM50379503
NameBDBM50379503
Synonyms:CHEMBL2012415
TypeSmall organic molecule
Emp. Form.C26H34N8O2
Mol. Mass.490.6006
SMILESCn1cc(Nc2ncc3cnn([C@H]4C[C@@H]5C[C@@H]5C4)c3n2)cc1C(=O)N1CCC[C@@H]1CN1CCOCC1