Reaction Details
TargetCannabinoid receptor 1
LigandBDBM50380717
Substrate/Competitorn/a
Meas. Tech.ChEMBL_813334 (CHEMBL2019455)
Ki 6.31±n/a nM
Citation Adam, JMClark, JKDavies, KEverett, KFields, RFrancis, SJeremiah, FKiyoi, TMaidment, MMorrison, ARatcliffe, PProsser, ASchulz, JWishart, GBaker, JBoyce, SCampbell, RCottney, JEDeehan, MMartin, I Low brain penetrant CB1 receptor agonists for the treatment of neuropathic pain. Bioorg Med Chem Lett22:2932-7 (2012) 
 
Cannabinoid receptor 1
Name:Cannabinoid receptor 1
Type:G Protein-Coupled Receptor (GPCR)
Mol. Mass.:52868.96
Organism:Homo sapiens (Human)
Description:P21554
Residue:472
BDBM50380717
NameBDBM50380717
Synonyms:CHEMBL2017678
TypeSmall organic molecule
Emp. Form.C24H32N6O3S
Mol. Mass.484.614
SMILESCOc1cccc2c(cn(CC3CCOCC3)c12)-c1nsc(CN2CCN(CC(N)=O)CC2)n1