Reaction Details
TargetPotassium voltage-gated channel subfamily H member 2
LigandBDBM50380718
Substrate/Competitorn/a
Meas. Tech.ChEMBL_813365 (CHEMBL2019592)
Ki 19952.62±n/a nM
Citation Adam, JMClark, JKDavies, KEverett, KFields, RFrancis, SJeremiah, FKiyoi, TMaidment, MMorrison, ARatcliffe, PProsser, ASchulz, JWishart, GBaker, JBoyce, SCampbell, RCottney, JEDeehan, MMartin, I Low brain penetrant CB1 receptor agonists for the treatment of neuropathic pain. Bioorg Med Chem Lett22:2932-7 (2012) 
 
Potassium voltage-gated channel subfamily H member 2
Name:Potassium voltage-gated channel subfamily H member 2
Type:Multi-pass membrane protein
Mol. Mass.:126672.65
Organism:Homo sapiens (Human)
Description:Q12809
Residue:1159
BDBM50380718
NameBDBM50380718
Synonyms:CHEMBL2017684
TypeSmall organic molecule
Emp. Form.C23H29ClN6O3
Mol. Mass.472.968
SMILESNC(=O)CN1CCN(Cc2nc(no2)-c2cn(CC3CCOCC3)c3c(Cl)cccc23)CC1