Reaction Details
TargetCannabinoid receptor 1
LigandBDBM50380720
Substrate/Competitorn/a
Meas. Tech.ChEMBL_813334 (CHEMBL2019455)
Ki 31.62±n/a nM
Citation Adam, JMClark, JKDavies, KEverett, KFields, RFrancis, SJeremiah, FKiyoi, TMaidment, MMorrison, ARatcliffe, PProsser, ASchulz, JWishart, GBaker, JBoyce, SCampbell, RCottney, JEDeehan, MMartin, I Low brain penetrant CB1 receptor agonists for the treatment of neuropathic pain. Bioorg Med Chem Lett22:2932-7 (2012) 
 
Cannabinoid receptor 1
Name:Cannabinoid receptor 1
Type:G Protein-Coupled Receptor (GPCR)
Mol. Mass.:52868.96
Organism:Homo sapiens (Human)
Description:P21554
Residue:472
BDBM50380720
NameBDBM50380720
Synonyms:CHEMBL2017682
TypeSmall organic molecule
Emp. Form.C25H32ClN5O4S2
Mol. Mass.566.136
SMILESOCCNC(=O)[C@H]1CCCN(Cc2nc(ns2)-c2cn(CC3CCS(=O)(=O)CC3)c3c(Cl)cccc23)C1