Reaction Details
TargetTransient receptor potential cation channel subfamily V member 1
LigandBDBM50382237
Substrate/Competitorn/a
Meas. Tech.ChEMBL_816251 (CHEMBL2026776)
IC50 3.3±n/a nM
Citation Urbahns, KYura, TGupta, JBTajimi, MFujishima, HMasuda, TYamamoto, NIkegami, YMarumo, MYasoshima, KYoshida, NMoriwaki, TMadge, DChan, FMogi, M Tetrahydro-naphthols as orally available TRPV1 inhibitors. Bioorg Med Chem Lett22:3408-11 (2012) 
 
Transient receptor potential cation channel subfamily V member 1
Name:Transient receptor potential cation channel subfamily V member 1
Type:Protein
Mol. Mass.:94960.75
Organism:Homo sapiens (Human)
Description:Q8NER1
Residue:839
BDBM50382237
NameBDBM50382237
Synonyms:CHEMBL2024668
TypeSmall organic molecule
Emp. Form.C18H16ClF3N2O2
Mol. Mass.384.78
SMILESOC1CCc2cccc(NC(=O)Nc3ccc(Cl)c(c3)C(F)(F)F)c2C1