Reaction Details
TargetEpidermal growth factor receptor
LigandBDBM50382959
Substrate/Competitorn/a
Meas. Tech.ChEMBL_817983 (CHEMBL2033409)
Kd 22±n/a nM
Citation Rowbottom, MWFaraoni, RChao, QCampbell, BTLai, AGSetti, EEzawa, MSprankle, KGAbraham, STran, LStruss, BGibney, MArmstrong, RCGunawardane, RNNepomuceno, RRValenta, IHua, HGardner, MFCramer, MDGitnick, DInsko, DEApuy, JLJones-Bolin, SGhose, AKHerbertz, TAtor, MADorsey, BDRuggeri, BWilliams, MBhagwat, SJames, JHolladay, MW Identification of 1-(3-(6,7-dimethoxyquinazolin-4-yloxy)phenyl)-3-(5-(1,1,1-trifluoro-2-methylpropan-2-yl)isoxazol-3-yl)urea hydrochloride (CEP-32496), a highly potent and orally efficacious inhibitor of V-RAF murine sarcoma viral oncogene homologue B1 (BRAF) V600E. J Med Chem55:1082-105 (2012) 
 
Epidermal growth factor receptor
Name:Epidermal growth factor receptor
Type:Receptor Kinase Domain
Mol. Mass.:134279.59
Organism:Homo sapiens (Human)
Description:P00533
Residue:1210
BDBM50382959
NameBDBM50382959
Synonyms:CEP-32496 US9730937, Example 261
TypeSmall organic molecule
Emp. Form.C24H22F3N5O5
Mol. Mass.517.4572
SMILESCOc1cc2ncnc(Oc3cccc(NC(=O)Nc4cc(on4)C(C)(C)C(F)(F)F)c3)c2cc1OC