Reaction Details
TargetMelanin-concentrating hormone receptor 1
LigandBDBM50383116
Substrate/Competitorn/a
Meas. Tech.ChEMBL_818766 (CHEMBL2033452)
IC50 0.36±n/a nM
Citation Kamata, MYamashita, TImaeda, TTanaka, TMasada, SKamaura, MKasai, SHara, RSasaki, STakekawa, SAsami, AKaisho, TSuzuki, NAshina, SOgino, HNakano, YNagisa, YKato, KKato, KIshihara, Y Melanin-concentrating hormone receptor 1 antagonists. Synthesis and structure-activity relationships of novel 3-(aminomethyl)quinolines. J Med Chem55:2353-66 (2012) 
 
Melanin-concentrating hormone receptor 1
Name:Melanin-concentrating hormone receptor 1
Type:G Protein-Coupled Receptor (GPCR)
Mol. Mass.:45976.27
Organism:Homo sapiens (Human)
Description:Membranes from CHO-K1 cells stably expressing human MCH1R were used in assays.
Residue:422
BDBM50383116
NameBDBM50383116
Synonyms:CHEMBL2031736
TypeSmall organic molecule
Emp. Form.C28H26ClN3O
Mol. Mass.455.979
SMILESCc1c(NC(=O)c2ccc(cc2)-c2ccc(Cl)cc2)ccc2cc(CN3CCCC3)cnc12