Reaction Details
TargetHistamine H3 receptor
LigandBDBM50383124
Substrate/Competitorn/a
Meas. Tech.ChEMBL_819070 (CHEMBL2034392)
Ki 25±n/a nM
Citation Zhou, DGross, JLAdedoyin, ABAschmies, SBBrennan, JBowlby, MDi, LKubek, KPlatt, BJWang, ZZhang, GBrandon, NComery, TARobichaud, AJ 2-(Pyrrolidin-1-yl)ethyl-3,4-dihydroisoquinolin-1(2H)-one derivatives as potent and selective histamine-3 receptor antagonists. J Med Chem55:2452-68 (2012) 
 
Histamine H3 receptor
Name:Histamine H3 receptor
Type:G Protein-Coupled Receptor (GPCR)
Mol. Mass.:48607.98
Organism:Rattus norvegicus (rat)
Description:n/a
Residue:445
BDBM50383124
NameBDBM50383124
Synonyms:CHEMBL2031747
TypeSmall organic molecule
Emp. Form.C22H23N3O
Mol. Mass.345.4375
SMILESO=C1N(CCN2CCCC2)CCc2cc(ccc12)-c1ccc(cc1)C#N