Reaction Details
TargetHistamine H1 receptor
LigandBDBM50383153
Substrate/Competitorn/a
Meas. Tech.ChEMBL_819073 (CHEMBL2034395)
Ki>10000±n/a nM
Citation Zhou, DGross, JLAdedoyin, ABAschmies, SBBrennan, JBowlby, MDi, LKubek, KPlatt, BJWang, ZZhang, GBrandon, NComery, TARobichaud, AJ 2-(Pyrrolidin-1-yl)ethyl-3,4-dihydroisoquinolin-1(2H)-one derivatives as potent and selective histamine-3 receptor antagonists. J Med Chem55:2452-68 (2012) 
 
Histamine H1 receptor
Name:Histamine H1 receptor
Type:G Protein-Coupled Receptor (GPCR)
Mol. Mass.:55808.72
Organism:Homo sapiens (Human)
Description:Cell pellets from SK-N-MC cells transfected with human H1 receptor were used in binding assay.
Residue:487
BDBM50383153
NameBDBM50383153
Synonyms:CHEMBL2031874
TypeSmall organic molecule
Emp. Form.C24H29N3O2
Mol. Mass.391.506
SMILESCN(C)C(=O)c1ccc(cc1)-c1ccc2C(=O)N(CCN3CCCC3)CCc2c1