Reaction Details
Target5-hydroxytryptamine receptor 1A
LigandBDBM50383163
Substrate/Competitorn/a
Meas. Tech.ChEMBL_819075 (CHEMBL2034397)
Ki 12200±n/a nM
Citation Zhou, DGross, JLAdedoyin, ABAschmies, SBBrennan, JBowlby, MDi, LKubek, KPlatt, BJWang, ZZhang, GBrandon, NComery, TARobichaud, AJ 2-(Pyrrolidin-1-yl)ethyl-3,4-dihydroisoquinolin-1(2H)-one derivatives as potent and selective histamine-3 receptor antagonists. J Med Chem55:2452-68 (2012) 
 
5-hydroxytryptamine receptor 1A
Name:5-hydroxytryptamine receptor 1A
Type:n/a
Mol. Mass.:46122.49
Organism:Homo sapiens (Human)
Description:n/a
Residue:422
BDBM50383163
NameBDBM50383163
Synonyms:CHEMBL2031885
TypeSmall organic molecule
Emp. Form.C27H33N3O2
Mol. Mass.431.5698
SMILESC[C@@H]1CCCN1CCN1CCc2cc(ccc2C1=O)-c1ccc(cc1)C(=O)N1CCCC1