Reaction Details
TargetAlpha-2A adrenergic receptor
LigandBDBM50383155
Substrate/Competitorn/a
Meas. Tech.ChEMBL_819079 (CHEMBL2034401)
Ki>3000±n/a nM
Citation Zhou, DGross, JLAdedoyin, ABAschmies, SBBrennan, JBowlby, MDi, LKubek, KPlatt, BJWang, ZZhang, GBrandon, NComery, TARobichaud, AJ 2-(Pyrrolidin-1-yl)ethyl-3,4-dihydroisoquinolin-1(2H)-one derivatives as potent and selective histamine-3 receptor antagonists. J Med Chem55:2452-68 (2012) 
 
Alpha-2A adrenergic receptor
Name:Alpha-2A adrenergic receptor
Type:Enzyme
Mol. Mass.:48979.91
Organism:Homo sapiens (Human)
Description:P08913
Residue:465
BDBM50383155
NameBDBM50383155
Synonyms:CHEMBL2031876
TypeSmall organic molecule
Emp. Form.C27H33N3O2
Mol. Mass.431.5698
SMILESC[C@@H]1CCCN1C(=O)c1ccc(cc1)-c1ccc2C(=O)N(CCN3CCCC3)CCc2c1