Reaction Details
TargetSodium-dependent serotonin transporter
LigandBDBM50383162
Substrate/Competitorn/a
Meas. Tech.ChEMBL_819080 (CHEMBL2034402)
Ki 300±n/a nM
Citation Zhou, DGross, JLAdedoyin, ABAschmies, SBBrennan, JBowlby, MDi, LKubek, KPlatt, BJWang, ZZhang, GBrandon, NComery, TARobichaud, AJ 2-(Pyrrolidin-1-yl)ethyl-3,4-dihydroisoquinolin-1(2H)-one derivatives as potent and selective histamine-3 receptor antagonists. J Med Chem55:2452-68 (2012) 
 
Sodium-dependent serotonin transporter
Name:Sodium-dependent serotonin transporter
Type:Multi-pass membrane protein
Mol. Mass.:70322.51
Organism:Homo sapiens (Human)
Description:P31645
Residue:630
BDBM50383162
NameBDBM50383162
Synonyms:CHEMBL2031884
TypeSmall organic molecule
Emp. Form.C25H31N3O2
Mol. Mass.405.5325
SMILESCCNC(=O)c1ccc(cc1)-c1ccc2C(=O)N(CCN3CCC[C@H]3C)CCc2c1