Reaction Details
TargetPotassium voltage-gated channel subfamily H member 2
LigandBDBM50383136
Substrate/Competitorn/a
Meas. Tech.ChEMBL_819072 (CHEMBL2034394)
IC50 300±n/a nM
Citation Zhou, DGross, JLAdedoyin, ABAschmies, SBBrennan, JBowlby, MDi, LKubek, KPlatt, BJWang, ZZhang, GBrandon, NComery, TARobichaud, AJ 2-(Pyrrolidin-1-yl)ethyl-3,4-dihydroisoquinolin-1(2H)-one derivatives as potent and selective histamine-3 receptor antagonists. J Med Chem55:2452-68 (2012) 
 
Potassium voltage-gated channel subfamily H member 2
Name:Potassium voltage-gated channel subfamily H member 2
Type:Multi-pass membrane protein
Mol. Mass.:126672.65
Organism:Homo sapiens (Human)
Description:Q12809
Residue:1159
BDBM50383136
NameBDBM50383136
Synonyms:CHEMBL2031760
TypeSmall organic molecule
Emp. Form.C22H25FN2O
Mol. Mass.352.4451
SMILESC[C@@H]1CCCN1CCN1CCc2cc(ccc2C1=O)-c1ccc(F)cc1