Reaction Details
TargetEpidermal growth factor receptor
LigandBDBM50383289
Substrate/Competitorn/a
Meas. Tech.ChEMBL_819567 (CHEMBL2033651)
IC50 0.38±n/a nM
Citation Chang, SZhang, LXu, SLuo, JLu, XZhang, ZXu, TLiu, YTu, ZXu, YRen, XGeng, MDing, JPei, DDing, K Design, synthesis, and biological evaluation of novel conformationally constrained inhibitors targeting epidermal growth factor receptor threonine7¿°¿ methionine7¿° mutant. J Med Chem55:2711-23 (2012) 
 
Epidermal growth factor receptor
Name:Epidermal growth factor receptor
Type:Receptor Kinase Domain
Mol. Mass.:134279.59
Organism:Homo sapiens (Human)
Description:P00533
Residue:1210
BDBM50383289
NameBDBM50383289
Synonyms:CHEMBL2029434
TypeSmall organic molecule
Emp. Form.C30H36N8O3
Mol. Mass.556.6586
SMILESCOc1cc(ccc1Nc1ncc2CN(C(C)C)C(=O)N(c3cccc(NC(=O)C=C)c3)c2n1)N1CCN(C)CC1