Reaction Details
TargetCell division cycle 7-related protein kinase
LigandBDBM50272192
Substrate/Competitorn/a
Meas. Tech.ChEMBL_819140 (CHEMBL2034660)
IC50 1.4±n/a nM
Citation Koltun, ESTsuhako, ALBrown, DSAay, NArcalas, AChan, VDu, HEngst, SFerguson, KFranzini, MGalan, AHolst, CRHuang, PKane, BKim, MHLi, JMarkby, DMohan, MNoson, KPlonowski, ARichards, SJRobertson, SShaw, KStott, GStout, TJYoung, JYu, PZaharia, CAZhang, WZhou, PNuss, JMXu, WKearney, PC Discovery of XL413, a potent and selective CDC7 inhibitor. Bioorg Med Chem Lett22:3727-31 (2012) 
 
Cell division cycle 7-related protein kinase
Name:Cell division cycle 7-related protein kinase
Type:Protein
Mol. Mass.:63908.16
Organism:Homo sapiens (Human)
Description:O00311
Residue:574
BDBM50272192
NameBDBM50272192
Synonyms:4-(4-hydroxy-3-methylphenyl)-6-phenylpyrimidin-2(1H)-one | CHEMBL501724
TypeSmall organic molecule
Emp. Form.C17H14N2O2
Mol. Mass.278.3053
SMILESCc1cc(ccc1O)-c1cc(nc(=O)[nH]1)-c1ccccc1