Reaction Details
TargetPeptide deformylase
LigandBDBM50383996
Substrate/Competitorn/a
Meas. Tech.ChEMBL_819737 (CHEMBL2034167)
IC50 0.1±n/a nM
Citation Axten, JMMedina, JRBlackledge, CWDuquenne, CGrant, SWBobko, MAPeng, TMiller, WHPinckney, TGallagher, TFKulkarni, SLewandowski, TVan Aller, GSZonis, RWard, PCampobasso, N Acylprolinamides: a new class of peptide deformylase inhibitors with in vivo antibacterial activity. Bioorg Med Chem Lett22:4028-32 (2012) 
 
Peptide deformylase
Name:Peptide deformylase
Type:PROTEIN
Mol. Mass.:22668.24
Organism:Streptococcus pneumoniae serotype 4 (strain ATCC BAA-334 / TIGR4)
Description:ChEMBL_819737
Residue:203
BDBM50383996
NameBDBM50383996
Synonyms:CHEMBL2032134
TypeSmall organic molecule
Emp. Form.C21H34N4O5
Mol. Mass.422.5185
SMILESON(C[C@@H](CC1CCCC1)C(=O)N1CCC[C@H]1C(=O)NC(=O)NC1CCCC1)C=O