Reaction Details
TargetPeptide deformylase
LigandBDBM50384001
Substrate/Competitorn/a
Meas. Tech.ChEMBL_819736 (CHEMBL2034166)
IC50 10±n/a nM
Citation Axten, JMMedina, JRBlackledge, CWDuquenne, CGrant, SWBobko, MAPeng, TMiller, WHPinckney, TGallagher, TFKulkarni, SLewandowski, TVan Aller, GSZonis, RWard, PCampobasso, N Acylprolinamides: a new class of peptide deformylase inhibitors with in vivo antibacterial activity. Bioorg Med Chem Lett22:4028-32 (2012) 
 
Peptide deformylase
Name:Peptide deformylase
Type:Enzyme
Mol. Mass.:20556.80
Organism:Staphylococcus aureus
Description:P68825
Residue:183
BDBM50384001
NameBDBM50384001
Synonyms:CHEMBL2032139
TypeSmall organic molecule
Emp. Form.C19H30N4O5
Mol. Mass.394.4653
SMILESON(C[C@@H](CC1CCCC1)C(=O)N1CCC[C@H]1C(=O)NC(=O)NCC=C)C=O