Reaction Details
TargetMacrophage-stimulating protein receptor
LigandBDBM50384006
Substrate/Competitorn/a
Meas. Tech.ChEMBL_819761 (CHEMBL2034273)
IC50 14±n/a nM
Citation Lee, JHan, SYJung, HYang, JChoi, JWChae, CHPark, CHChoi, SULee, KHa, JDLee, CORyu, JWKim, HRKoh, JSCho, SY Synthesis and structure-activity relationship of aminopyridines with substituted benzoxazoles as c-Met kinase inhibitors. Bioorg Med Chem Lett22:4044-8 (2012) 
 
Macrophage-stimulating protein receptor
Name:Macrophage-stimulating protein receptor
Type:Protein
Mol. Mass.:152270.76
Organism:Homo sapiens (Human)
Description:Q04912
Residue:1400
BDBM50384006
NameBDBM50384006
Synonyms:CHEMBL2032274
TypeSmall organic molecule
Emp. Form.C20H20N6O2
Mol. Mass.376.4118
SMILESNc1ncc(cc1-c1nc2ccc(O)cc2o1)-c1cnn(c1)C1CCNCC1