Reaction Details
TargetHepatocyte growth factor receptor
LigandBDBM50384033
Substrate/Competitorn/a
Meas. Tech.ChEMBL_819757 (CHEMBL2034187)
IC50 150±n/a nM
Citation Lee, JHan, SYJung, HYang, JChoi, JWChae, CHPark, CHChoi, SULee, KHa, JDLee, CORyu, JWKim, HRKoh, JSCho, SY Synthesis and structure-activity relationship of aminopyridines with substituted benzoxazoles as c-Met kinase inhibitors. Bioorg Med Chem Lett22:4044-8 (2012) 
 
Hepatocyte growth factor receptor
Name:Hepatocyte growth factor receptor
Type:Protein
Mol. Mass.:155559.73
Organism:Homo sapiens (Human)
Description:P08581
Residue:1390
BDBM50384033
NameBDBM50384033
Synonyms:CHEMBL2032160
TypeSmall organic molecule
Emp. Form.C23H27N7O
Mol. Mass.417.5068
SMILESCCCNc1ccc2nc(oc2c1)-c1cc(cnc1N)-c1cnn(c1)C1CCNCC1