Reaction Details
TargetHepatocyte growth factor receptor
LigandBDBM50384044
Substrate/Competitorn/a
Meas. Tech.ChEMBL_819757 (CHEMBL2034187)
IC50 53±n/a nM
Citation Lee, JHan, SYJung, HYang, JChoi, JWChae, CHPark, CHChoi, SULee, KHa, JDLee, CORyu, JWKim, HRKoh, JSCho, SY Synthesis and structure-activity relationship of aminopyridines with substituted benzoxazoles as c-Met kinase inhibitors. Bioorg Med Chem Lett22:4044-8 (2012) 
 
Hepatocyte growth factor receptor
Name:Hepatocyte growth factor receptor
Type:Protein
Mol. Mass.:155559.73
Organism:Homo sapiens (Human)
Description:P08581
Residue:1390
BDBM50384044
NameBDBM50384044
Synonyms:CHEMBL2032149
TypeSmall organic molecule
Emp. Form.C20H19ClN6O
Mol. Mass.394.857
SMILESNc1ncc(cc1-c1nc2cc(Cl)ccc2o1)-c1cnn(c1)C1CCNCC1