Reaction Details
TargetReceptor-type tyrosine-protein kinase FLT3
LigandBDBM50384019
Substrate/Competitorn/a
Meas. Tech.ChEMBL_819758 (CHEMBL2034188)
IC50 3.6±n/a nM
Citation Lee, JHan, SYJung, HYang, JChoi, JWChae, CHPark, CHChoi, SULee, KHa, JDLee, CORyu, JWKim, HRKoh, JSCho, SY Synthesis and structure-activity relationship of aminopyridines with substituted benzoxazoles as c-Met kinase inhibitors. Bioorg Med Chem Lett22:4044-8 (2012) 
 
Receptor-type tyrosine-protein kinase FLT3
Name:Receptor-type tyrosine-protein kinase FLT3
Type:Enzyme
Mol. Mass.:112888.62
Organism:Homo sapiens (Human)
Description:P36888
Residue:993
BDBM50384019
NameBDBM50384019
Synonyms:CHEMBL2032285 | CHEMBL2079397
TypeSmall organic molecule
Emp. Form.C20H21N7O
Mol. Mass.375.427
SMILESNc1ccc2nc(oc2c1)-c1cc(cnc1N)-c1cnn(c1)C1CCNCC1