Reaction Details
TargetHepatocyte growth factor receptor
LigandBDBM50384034
Substrate/Competitorn/a
Meas. Tech.ChEMBL_819757 (CHEMBL2034187)
IC50 540±n/a nM
Citation Lee, JHan, SYJung, HYang, JChoi, JWChae, CHPark, CHChoi, SULee, KHa, JDLee, CORyu, JWKim, HRKoh, JSCho, SY Synthesis and structure-activity relationship of aminopyridines with substituted benzoxazoles as c-Met kinase inhibitors. Bioorg Med Chem Lett22:4044-8 (2012) 
 
Hepatocyte growth factor receptor
Name:Hepatocyte growth factor receptor
Type:Protein
Mol. Mass.:155559.73
Organism:Homo sapiens (Human)
Description:P08581
Residue:1390
BDBM50384034
NameBDBM50384034
Synonyms:CHEMBL2032159 | CHEMBL2032299
TypeSmall organic molecule
Emp. Form.C22H23N7O2
Mol. Mass.417.4637
SMILESCC(=O)Nc1ccc2oc(nc2c1)-c1cc(cnc1N)-c1cnn(c1)C1CCNCC1