Reaction Details
TargetSphingosine 1-phosphate receptor 1
LigandBDBM50420009
Substrate/Competitorn/a
Meas. Tech.ChEMBL_819767 (CHEMBL2034279)
EC50 0.1±n/a nM
Citation Deng, GMeng, QLiu, QXu, XXu, QRen, FGuo, TBLu, HXiang, JNElliott, JDLin, X Identification of benzoxazole analogs as novel, S1P(3) sparing S1P(1) agonists. Bioorg Med Chem Lett22:3973-7 (2012) 
 
Sphingosine 1-phosphate receptor 1
Name:Sphingosine 1-phosphate receptor 1
Type:Enzyme
Mol. Mass.:42836.02
Organism:Homo sapiens (Human)
Description:P21453
Residue:382
BDBM50420009
NameBDBM50420009
Synonyms:CHEMBL2032441
TypeSmall organic molecule
Emp. Form.C27H23F3N2O3
Mol. Mass.480.4783
SMILESOC(=O)C1CN(CCCc2ccc3oc(nc3c2)-c2ccc(-c3ccccc3)c(c2)C(F)(F)F)C1