Reaction Details
TargetSphingosine 1-phosphate receptor 3
LigandBDBM50420021
Substrate/Competitorn/a
Meas. Tech.ChEMBL_819768 (CHEMBL2034280)
EC50>10000±n/a nM
Citation Deng, GMeng, QLiu, QXu, XXu, QRen, FGuo, TBLu, HXiang, JNElliott, JDLin, X Identification of benzoxazole analogs as novel, S1P(3) sparing S1P(1) agonists. Bioorg Med Chem Lett22:3973-7 (2012) 
 
Sphingosine 1-phosphate receptor 3
Name:Sphingosine 1-phosphate receptor 3
Type:G Protein-Coupled Receptor (GPCR)
Mol. Mass.:42278.13
Organism:Homo sapiens (Human)
Description:Q99500
Residue:378
BDBM50420021
NameBDBM50420021
Synonyms:CHEMBL2032313
TypeSmall organic molecule
Emp. Form.C25H21F3N2O2S
Mol. Mass.470.507
SMILESOC(=O)CCCCCc1cnc2sc(nc2c1)-c1ccc(-c2ccccc2)c(c1)C(F)(F)F