Reaction Details
TargetSphingosine 1-phosphate receptor 3
LigandBDBM50420027
Substrate/Competitorn/a
Meas. Tech.ChEMBL_819768 (CHEMBL2034280)
EC50 1000±n/a nM
Citation Deng, GMeng, QLiu, QXu, XXu, QRen, FGuo, TBLu, HXiang, JNElliott, JDLin, X Identification of benzoxazole analogs as novel, S1P(3) sparing S1P(1) agonists. Bioorg Med Chem Lett22:3973-7 (2012) 
 
Sphingosine 1-phosphate receptor 3
Name:Sphingosine 1-phosphate receptor 3
Type:G Protein-Coupled Receptor (GPCR)
Mol. Mass.:42278.13
Organism:Homo sapiens (Human)
Description:Q99500
Residue:378
BDBM50420027
NameBDBM50420027
Synonyms:CHEMBL2032429
TypeSmall organic molecule
Emp. Form.C26H23F3N2O3
Mol. Mass.468.4676
SMILESCN(CCCc1ccc2oc(nc2c1)-c1ccc(-c2ccccc2)c(c1)C(F)(F)F)CC(O)=O