Reaction Details
TargetSphingosine 1-phosphate receptor 3
LigandBDBM50420038
Substrate/Competitorn/a
Meas. Tech.ChEMBL_819768 (CHEMBL2034280)
EC50 794.33±n/a nM
Citation Deng, GMeng, QLiu, QXu, XXu, QRen, FGuo, TBLu, HXiang, JNElliott, JDLin, X Identification of benzoxazole analogs as novel, S1P(3) sparing S1P(1) agonists. Bioorg Med Chem Lett22:3973-7 (2012) 
 
Sphingosine 1-phosphate receptor 3
Name:Sphingosine 1-phosphate receptor 3
Type:G Protein-Coupled Receptor (GPCR)
Mol. Mass.:42278.13
Organism:Homo sapiens (Human)
Description:Q99500
Residue:378
BDBM50420038
NameBDBM50420038
Synonyms:CHEMBL2032440
TypeSmall organic molecule
Emp. Form.C26H21F3N2O3
Mol. Mass.466.4517
SMILESOC(=O)C1CN(CCc2ccc3oc(nc3c2)-c2ccc(-c3ccccc3)c(c2)C(F)(F)F)C1