Reaction Details
TargetSphingosine 1-phosphate receptor 1
LigandBDBM50420015
Substrate/Competitorn/a
Meas. Tech.ChEMBL_819767 (CHEMBL2034279)
EC50 158.49±n/a nM
Citation Deng, GMeng, QLiu, QXu, XXu, QRen, FGuo, TBLu, HXiang, JNElliott, JDLin, X Identification of benzoxazole analogs as novel, S1P(3) sparing S1P(1) agonists. Bioorg Med Chem Lett22:3973-7 (2012) 
 
Sphingosine 1-phosphate receptor 1
Name:Sphingosine 1-phosphate receptor 1
Type:Enzyme
Mol. Mass.:42836.02
Organism:Homo sapiens (Human)
Description:P21453
Residue:382
BDBM50420015
NameBDBM50420015
Synonyms:CHEMBL2032307
TypeSmall organic molecule
Emp. Form.C21H23ClN2O4
Mol. Mass.402.871
SMILESCC(C)Oc1ccc(cc1Cl)-c1nc2cc(CCCCCC(O)=O)cnc2o1