Reaction Details
TargetSphingosine 1-phosphate receptor 1
LigandBDBM50420025
Substrate/Competitorn/a
Meas. Tech.ChEMBL_819767 (CHEMBL2034279)
EC50 63.1±n/a nM
Citation Deng, GMeng, QLiu, QXu, XXu, QRen, FGuo, TBLu, HXiang, JNElliott, JDLin, X Identification of benzoxazole analogs as novel, S1P(3) sparing S1P(1) agonists. Bioorg Med Chem Lett22:3973-7 (2012) 
 
Sphingosine 1-phosphate receptor 1
Name:Sphingosine 1-phosphate receptor 1
Type:Enzyme
Mol. Mass.:42836.02
Organism:Homo sapiens (Human)
Description:P21453
Residue:382
BDBM50420025
NameBDBM50420025
Synonyms:CHEMBL2032317
TypeSmall organic molecule
Emp. Form.C24H21F3N2O2S
Mol. Mass.458.496
SMILESOC(=O)CCCCCc1cn2cc(nc2s1)-c1ccc(-c2ccccc2)c(c1)C(F)(F)F