Reaction Details
TargetSphingosine 1-phosphate receptor 1
LigandBDBM50420029
Substrate/Competitorn/a
Meas. Tech.ChEMBL_819767 (CHEMBL2034279)
EC50 0.631±n/a nM
Citation Deng, GMeng, QLiu, QXu, XXu, QRen, FGuo, TBLu, HXiang, JNElliott, JDLin, X Identification of benzoxazole analogs as novel, S1P(3) sparing S1P(1) agonists. Bioorg Med Chem Lett22:3973-7 (2012) 
 
Sphingosine 1-phosphate receptor 1
Name:Sphingosine 1-phosphate receptor 1
Type:Enzyme
Mol. Mass.:42836.02
Organism:Homo sapiens (Human)
Description:P21453
Residue:382
BDBM50420029
NameBDBM50420029
Synonyms:CHEMBL2032431
TypeSmall organic molecule
Emp. Form.C26H21F3N2O3
Mol. Mass.466.4517
SMILESOC(=O)C1CCN(CC1)c1ccc2oc(nc2c1)-c1ccc(-c2ccccc2)c(c1)C(F)(F)F