Reaction Details
TargetPotassium voltage-gated channel subfamily H member 2
LigandBDBM50384156
Substrate/Competitorn/a
Meas. Tech.ChEMBL_820025 (CHEMBL2032798)
IC50>33000±n/a nM
Citation Wei, ZYang, HLiu, ZTremblay, MJohnstone, SBéha, SYue, SYSrivastava, STomaszewski, MJBrown, WWalpole, CSt-Onge, SLessard, EArchambault, AJGroblewski, TPagé, D N-Methyl-3-(tetrahydro-2H-pyran-4-yl)-2,3,4,9-tetrahydro-1H-carbazole-6-carboxamides as a novel class of cannabinoid receptors agonists with low CNS penetration. Bioorg Med Chem Lett22:3884-9 (2012) 
 
Potassium voltage-gated channel subfamily H member 2
Name:Potassium voltage-gated channel subfamily H member 2
Type:Multi-pass membrane protein
Mol. Mass.:126672.65
Organism:Homo sapiens (Human)
Description:Q12809
Residue:1159
BDBM50384156
NameBDBM50384156
Synonyms:CHEMBL2029738
TypeSmall organic molecule
Emp. Form.C26H37N3O4
Mol. Mass.455.5897
SMILESCN(CCCC(=O)NCCO)C(=O)c1ccc2n(C)c3CC[C@H](Cc3c2c1)C1CCOCC1