Reaction Details
TargetCannabinoid receptor 1
LigandBDBM50218116
Substrate/Competitorn/a
Meas. Tech.ChEMBL_820020 (CHEMBL2032793)
Ki 35±n/a nM
Citation Wei, ZYang, HLiu, ZTremblay, MJohnstone, SBéha, SYue, SYSrivastava, STomaszewski, MJBrown, WWalpole, CSt-Onge, SLessard, EArchambault, AJGroblewski, TPagé, D N-Methyl-3-(tetrahydro-2H-pyran-4-yl)-2,3,4,9-tetrahydro-1H-carbazole-6-carboxamides as a novel class of cannabinoid receptors agonists with low CNS penetration. Bioorg Med Chem Lett22:3884-9 (2012) 
 
Cannabinoid receptor 1
Name:Cannabinoid receptor 1
Type:G Protein-Coupled Receptor (GPCR)
Mol. Mass.:52868.96
Organism:Homo sapiens (Human)
Description:P21554
Residue:472
BDBM50218116
NameBDBM50218116
Synonyms:CHEMBL244403 | naphthalen-1-yl-(4-pentyloxynaphthalen-1-yl)methanone
TypeSmall organic molecule
Emp. Form.C26H24O2
Mol. Mass.368.4676
SMILESCCCCCOc1ccc(C(=O)c2cccc3ccccc23)c2ccccc12