Reaction Details
TargetCannabinoid receptor 1
LigandBDBM50384155
Substrate/Competitorn/a
Meas. Tech.ChEMBL_820022 (CHEMBL2032795)
EC50 101±n/a nM
Citation Wei, ZYang, HLiu, ZTremblay, MJohnstone, SBéha, SYue, SYSrivastava, STomaszewski, MJBrown, WWalpole, CSt-Onge, SLessard, EArchambault, AJGroblewski, TPagé, D N-Methyl-3-(tetrahydro-2H-pyran-4-yl)-2,3,4,9-tetrahydro-1H-carbazole-6-carboxamides as a novel class of cannabinoid receptors agonists with low CNS penetration. Bioorg Med Chem Lett22:3884-9 (2012) 
 
Cannabinoid receptor 1
Name:Cannabinoid receptor 1
Type:G Protein-Coupled Receptor (GPCR)
Mol. Mass.:52868.96
Organism:Homo sapiens (Human)
Description:P21554
Residue:472
BDBM50384155
NameBDBM50384155
Synonyms:CHEMBL2029737
TypeSmall organic molecule
Emp. Form.C26H37N3O4
Mol. Mass.455.5897
SMILESCNC(=O)CC[C@@H](CO)N(C)C(=O)c1ccc2n(C)c3CC[C@H](Cc3c2c1)C1CCOCC1