Reaction Details
TargetAurora kinase B
LigandBDBM50384176
Substrate/Competitorn/a
Meas. Tech.ChEMBL_820049 (CHEMBL2032822)
IC50 60±n/a nM
Citation Le Brazidec, JYPasis, ATam, BBoykin, CWang, DMarcotte, DJClaassen, GChong, JHChao, JFan, JNguyen, KSilvian, LLing, LZhang, LChoi, MTeng, MPathan, NZhao, SLi, TTaveras, A Structure-based design of 2,6,7-trisubstituted-7H-pyrrolo[2,3-d]pyrimidines as Aurora kinases inhibitors. Bioorg Med Chem Lett22:4033-7 (2012) 
 
Aurora kinase B
Name:Aurora kinase B
Type:Protein
Mol. Mass.:39327.72
Organism:Homo sapiens (Human)
Description:Q96GD4
Residue:344
BDBM50384176
NameBDBM50384176
Synonyms:CHEMBL2029904
TypeSmall organic molecule
Emp. Form.C24H34N8O
Mol. Mass.450.5798
SMILESCNCc1cc2cnc(Nc3cc(C(=O)N4CCN(C)CC4)n(C)c3)nc2n1C1CCCC1