Reaction Details
TargetCyclin-dependent kinase 1
LigandBDBM50384172
Substrate/Competitorn/a
Meas. Tech.ChEMBL_820050 (CHEMBL2032823)
IC50 3±n/a nM
Citation Le Brazidec, JYPasis, ATam, BBoykin, CWang, DMarcotte, DJClaassen, GChong, JHChao, JFan, JNguyen, KSilvian, LLing, LZhang, LChoi, MTeng, MPathan, NZhao, SLi, TTaveras, A Structure-based design of 2,6,7-trisubstituted-7H-pyrrolo[2,3-d]pyrimidines as Aurora kinases inhibitors. Bioorg Med Chem Lett22:4033-7 (2012) 
 
Cyclin-dependent kinase 1
Name:Cyclin-dependent kinase 1
Type:Enzyme Subunit
Mol. Mass.:34101.08
Organism:Homo sapiens (Human)
Description:P06493
Residue:297
BDBM50384172
NameBDBM50384172
Synonyms:CHEMBL2029900
TypeSmall organic molecule
Emp. Form.C23H30N8O2
Mol. Mass.450.5367
SMILESCN1CCN(CC1)C(=O)c1cc(Nc2ncc3cc(CN=O)n(C4CCCC4)c3n2)cn1C