Reaction Details
TargetAurora kinase B
LigandBDBM50384170
Substrate/Competitorn/a
Meas. Tech.ChEMBL_820049 (CHEMBL2032822)
IC50 4±n/a nM
Citation Le Brazidec, JYPasis, ATam, BBoykin, CWang, DMarcotte, DJClaassen, GChong, JHChao, JFan, JNguyen, KSilvian, LLing, LZhang, LChoi, MTeng, MPathan, NZhao, SLi, TTaveras, A Structure-based design of 2,6,7-trisubstituted-7H-pyrrolo[2,3-d]pyrimidines as Aurora kinases inhibitors. Bioorg Med Chem Lett22:4033-7 (2012) 
 
Aurora kinase B
Name:Aurora kinase B
Type:Protein
Mol. Mass.:39327.72
Organism:Homo sapiens (Human)
Description:Q96GD4
Residue:344
BDBM50384170
NameBDBM50384170
Synonyms:CHEMBL2029913
TypeSmall organic molecule
Emp. Form.C26H33N9O
Mol. Mass.487.5999
SMILESCN1CCN(CC1)C(=O)c1cc(Nc2ncc3cc(-c4ccnn4C)n(C4CCCC4)c3n2)cn1C