Reaction Details
TargetBcl-2-like protein 1
LigandBDBM50384362
Substrate/Competitorn/a
Meas. Tech.ChEMBL_818177 (CHEMBL2033954)
IC50 26±n/a nM
Citation Perez, HLBanfi, PBertrand, JCai, ZWGrebinski, JWKim, KLippy, JModugno, MNaglich, JSchmidt, RJTebben, AVianello, PWei, DDZhang, LGalvani, ALombardo, LJBorzilleri, RM Identification of a phenylacylsulfonamide series of dual Bcl-2/Bcl-xL antagonists. Bioorg Med Chem Lett22:3946-50 (2012) 
 
Bcl-2-like protein 1
Name:Bcl-2-like protein 1
Type:Mitochondrion membrane; Single-pass membrane protein
Mol. Mass.:26039.60
Organism:Homo sapiens (Human)
Description:n/a
Residue:233
BDBM50384362
NameBDBM50384362
Synonyms:CHEMBL2031032
TypeSmall organic molecule
Emp. Form.C39H41ClN6O5S
Mol. Mass.741.298
SMILESCCCCN(CCCC)C(=O)c1nn(c(C)c1Cl)-c1ccc(cc1C(=O)N1CNc2ccccc2C1)C(=O)NS(=O)(=O)c1ccc2ccccc2c1