Reaction Details
TargetTyrosine-protein kinase receptor UFO
LigandBDBM50384603
Substrate/Competitorn/a
Meas. Tech.ChEMBL_820660 (CHEMBL2037931)
IC50 47±n/a nM
Citation Liu, JYang, CSimpson, CDeryckere, DVan Deusen, AMiley, MJKireev, DNorris-Drouin, JSather, SHunter, DKorboukh, VKPatel, HSJanzen, WPMachius, MJohnson, GLEarp, HSGraham, DKFrye, SVWang, X Discovery of Novel Small Molecule Mer Kinase Inhibitors for the Treatment of Pediatric Acute Lymphoblastic Leukemia. ACS Med Chem Lett3:129-134 (2012) 
 
Tyrosine-protein kinase receptor UFO
Name:Tyrosine-protein kinase receptor UFO
Type:Enzyme
Mol. Mass.:98316.97
Organism:Homo sapiens (Human)
Description:P30530
Residue:894
BDBM50384603
NameBDBM50384603
Synonyms:CHEMBL2036796 | US9744172, Compound UNC00000463A
TypeSmall organic molecule
Emp. Form.C23H32N6
Mol. Mass.392.5404
SMILESCCCCCNc1ncc2c(nn(CC3CCC(N)CC3)c2n1)-c1ccccc1