Reaction Details
TargetTyrosine-protein kinase receptor TYRO3
LigandBDBM50384581
Substrate/Competitorn/a
Meas. Tech.ChEMBL_820661 (CHEMBL2037932)
IC50 14±n/a nM
Citation Liu, JYang, CSimpson, CDeryckere, DVan Deusen, AMiley, MJKireev, DNorris-Drouin, JSather, SHunter, DKorboukh, VKPatel, HSJanzen, WPMachius, MJohnson, GLEarp, HSGraham, DKFrye, SVWang, X Discovery of Novel Small Molecule Mer Kinase Inhibitors for the Treatment of Pediatric Acute Lymphoblastic Leukemia. ACS Med Chem Lett3:129-134 (2012) 
 
Tyrosine-protein kinase receptor TYRO3
Name:Tyrosine-protein kinase receptor TYRO3
Type:Protein
Mol. Mass.:96894.13
Organism:Homo sapiens (Human)
Description:Q06418
Residue:890
BDBM50384581
NameBDBM50384581
Synonyms:CHEMBL2036804
TypeSmall organic molecule
Emp. Form.C25H37N9
Mol. Mass.463.6216
SMILESCCCCNc1ncc2c(nn(C[C@H]3CC[C@H](N)CC3)c2n1)-c1ccc(nc1)N1CCNCC1