Reaction Details
TargetTyrosine-protein kinase Mer
LigandBDBM50384582
Substrate/Competitorn/a
Meas. Tech.ChEMBL_820664 (CHEMBL2037935)
Ki 1.4±n/a nM
Citation Liu, JYang, CSimpson, CDeryckere, DVan Deusen, AMiley, MJKireev, DNorris-Drouin, JSather, SHunter, DKorboukh, VKPatel, HSJanzen, WPMachius, MJohnson, GLEarp, HSGraham, DKFrye, SVWang, X Discovery of Novel Small Molecule Mer Kinase Inhibitors for the Treatment of Pediatric Acute Lymphoblastic Leukemia. ACS Med Chem Lett3:129-134 (2012) 
 
Tyrosine-protein kinase Mer
Name:Tyrosine-protein kinase Mer
Type:PROTEIN
Mol. Mass.:110234.77
Organism:Homo sapiens (Human)
Description:ChEMBL_1498723
Residue:999
BDBM50384582
NameBDBM50384582
Synonyms:CHEMBL2036805
TypeSmall organic molecule
Emp. Form.C30H39N9
Mol. Mass.525.691
SMILESN[C@H]1CC[C@H](Cn2nc(-c3ccc(nc3)N3CCNCC3)c3cnc(NCCCc4ccccc4)nc23)CC1