Reaction Details
TargetTyrosine-protein kinase Mer
LigandBDBM50384583
Substrate/Competitorn/a
Meas. Tech.ChEMBL_820664 (CHEMBL2037935)
Ki 0.73±n/a nM
Citation Liu, JYang, CSimpson, CDeryckere, DVan Deusen, AMiley, MJKireev, DNorris-Drouin, JSather, SHunter, DKorboukh, VKPatel, HSJanzen, WPMachius, MJohnson, GLEarp, HSGraham, DKFrye, SVWang, X Discovery of Novel Small Molecule Mer Kinase Inhibitors for the Treatment of Pediatric Acute Lymphoblastic Leukemia. ACS Med Chem Lett3:129-134 (2012) 
 
Tyrosine-protein kinase Mer
Name:Tyrosine-protein kinase Mer
Type:PROTEIN
Mol. Mass.:110234.77
Organism:Homo sapiens (Human)
Description:ChEMBL_1498723
Residue:999
BDBM50384583
NameBDBM50384583
Synonyms:CHEMBL2036806
TypeSmall organic molecule
Emp. Form.C26H38N8
Mol. Mass.462.6335
SMILESCCCCNc1ncc2c(nn(C[C@H]3CC[C@H](N)CC3)c2n1)-c1ccc(cc1)N1CCNCC1